Zdroj
is part of: dcat-ap-cz-360-2023#
type: TermProfile
preferred label: Resource @en
definition: Anything described by RDF. @en
definition: Cokoliv, co má URL ve schématu HTTPS.
profile of: Zdroj
reuses property value: PropertyValueReuse
  reused property: scopeNote
  reused as property: scopeNote
  reused from resource: Zdroj
type: ClassProfile
class role: supportive

Emailová adresa
is part of: dcat-ap-cz-360-2023#
type: TermProfile
preferred label: Resource @en
definition: Anything described by RDF. @en
definition: Cokoliv, co má URL ve schématu mailto:
profile of: Zdroj
reuses property value: PropertyValueReuse
  reused property: scopeNote
  reused as property: scopeNote
  reused from resource: Zdroj
type: ClassProfile
class role: supportive

Organizace
is part of: dcat-ap-cz-360-2023#
type: TermProfile
preferred label: Organization @en
reuses property value: PropertyValueReuse
  reused property: definition
  reused as property: definition
  reused from resource: Organization
type: ClassProfile
class: Organization
class role: supportive

Distribuce.příslušnýPrávníPředpis
is part of: dcat-ap-cz-360-2023#
type: TermProfile
scope note: Pro účely identifikace datové sady zpřístupněné datovým rozhraním dle vyhlášky č. 360/2023 Sb. musí obsahovat hodnoty: https://www.e-sbirka.cz/eli/cz/sb/2000/365/2024-01-20 https://www.e-sbirka.cz/sb/2023/360/2024-07-01
profile of: Distribuce.příslušnýPrávníPředpis
reuses property value: PropertyValueReuse
  reused property: prefLabel
  reused as property: prefLabel
  reused from resource: Distribuce.příslušnýPrávníPředpis
reuses property value: PropertyValueReuse
  reused property: definition
  reused as property: definition
  reused from resource: Distribuce.příslušnýPrávníPředpis
cardinality: 1n
domain: Distribuce
type: ObjectPropertyProfile
object property range: PrávníPředpis

DatováSlužba.příslušnýPrávníPředpis
is part of: dcat-ap-cz-360-2023#
type: TermProfile
scope note: Pro účely identifikace datové sady zpřístupněné datovým rozhraním dle vyhlášky č. 360/2023 Sb. musí obsahovat hodnoty: https://www.e-sbirka.cz/eli/cz/sb/2000/365/2024-01-20 https://www.e-sbirka.cz/sb/2023/360/2024-07-01
profile of: DatováSlužba.příslušnýPrávníPředpis
reuses property value: PropertyValueReuse
  reused property: prefLabel
  reused as property: prefLabel
  reused from resource: DatováSlužba.příslušnýPrávníPředpis
reuses property value: PropertyValueReuse
  reused property: definition
  reused as property: definition
  reused from resource: DatováSlužba.příslušnýPrávníPředpis
cardinality: 1n
domain: DatováSlužba
type: ObjectPropertyProfile
object property range: PrávníPředpis

DatováSada.příslušnýPrávníPředpis
is part of: dcat-ap-cz-360-2023#
type: TermProfile
scope note: Pro účely identifikace datové sady zpřístupněné datovým rozhraním dle vyhlášky č. 360/2023 Sb. musí obsahovat hodnoty: https://www.e-sbirka.cz/eli/cz/sb/2000/365/2024-01-20 a https://www.e-sbirka.cz/sb/2023/360/2024-07-01
profile of: DatováSada.příslušnýPrávníPředpis
reuses property value: PropertyValueReuse
  reused property: prefLabel
  reused as property: prefLabel
  reused from resource: DatováSada.příslušnýPrávníPředpis
reuses property value: PropertyValueReuse
  reused property: definition
  reused as property: definition
  reused from resource: DatováSada.příslušnýPrávníPředpis
cardinality: 1n
domain: DatováSada
type: ObjectPropertyProfile
object property range: PrávníPředpis