HVD category
is part of: dcat-ap-cz-hvd#
type: TermProfile
preferred label: Kategorie HVD @cs
definition: HVD category from the EU High-value dataset categories NAL.
definition: Kategorie HVD z EU číselníku High-value dataset categories. @cs
scope note: In DCAT-AP, a Concept is used to denote codes within a codelist.
scope note: Téma z evropského číselníku kategorií HVD EUV-HVD. Je třeba používat co nejdetailnější kategorii, např. http://data.europa.eu/bna/c_1e787364 pro "Referenční údaje pro vodočty, které jsou důležité pro plavbu", nikoliv pouze http://data.europa.eu/bna/c_b79e35eb pro Mobilitu. @cs
profile of: Koncept
type: ClassProfile
class role: main

European licence
is part of: dcat-ap-cz-hvd#
type: TermProfile
preferred label: Evropská licence @cs
definition: Licence from the Licence EU NAL EUV-LIC.
definition: Licence z evropského číselníku licencí EUV-LIC. @cs
profile of: Koncept
reuses property value: PropertyValueReuse
  reused property: scopeNote
  reused as property: scopeNote
  reused from resource: Koncept
type: ClassProfile
class role: main

KontaktníBod.email
is part of: dcat-ap-cz-hvd#
type: TermProfile
definition: A email address via which contact can be made.
definition: E-mailová adresa, na které lze navázat kontakt. @cs
profile of: Kind.email
reuses property value: PropertyValueReuse
  reused property: prefLabel
  reused as property: prefLabel
  reused from resource: KontaktníBod.email
reuses property value: PropertyValueReuse
  reused property: scopeNote
  reused as property: scopeNote
  reused from resource: Kind.email
cardinality: https://w3id.org/dsv/cardinality#01
domain: KontaktníBod
requirement level: recommended
type: ObjectPropertyProfile
object property range: E-mailAddress

HVD category
is part of: dcat-ap-cz-hvd#
type: TermProfile
preferred label: kategorie HVD @cs
definition: The HVD category to which this Dataset belongs.
definition: Kategorie HVD do které datová sada patří. @cs
profile of: Dataset.hvdCategory
reuses property value: PropertyValueReuse
  reused property: scopeNote
  reused as property: scopeNote
  reused from resource: Dataset.hvdCategory
cardinality: 1n
domain: DatováSada
requirement level: mandatory
type: ObjectPropertyProfile
object property range: HVD category

HVD category
is part of: dcat-ap-cz-hvd#
type: TermProfile
preferred label: kategorie HVD @cs
definition: The HVD category to which this Dataset Series belongs.
definition: Kategorie HVD do které série datových sad patří. @cs
profile of: DatasetSeries.hvdCategory
reuses property value: PropertyValueReuse
  reused property: scopeNote
  reused as property: scopeNote
  reused from resource: DatasetSeries.hvdCategory
cardinality: 1n
domain: SérieDatovýchSad
requirement level: mandatory
type: ObjectPropertyProfile
object property range: HVD category

HVD category
is part of: dcat-ap-cz-hvd#
type: TermProfile
preferred label: kategorie HVD @cs
definition: The HVD category to which this Data Service belongs.
definition: Kategorie HVD do které datová služba patří. @cs
profile of: DataService.hvdCategory
reuses property value: PropertyValueReuse
  reused property: scopeNote
  reused as property: scopeNote
  reused from resource: DataService.hvdCategory
cardinality: 1n
domain: DatováSlužba
requirement level: mandatory
type: ObjectPropertyProfile
object property range: HVD category

contact page
is part of: dcat-ap-cz-hvd#
type: TermProfile
preferred label: kontaktní stránka @cs
definition: A webpage that either allows to make contact (i.e. a webform) or the information contains how to get into contact.
definition: Webová stránka, která buďto přímo umožňuje navázat kontakt, nebo obsahuje informace o tom, jak navázat kontakt. @cs
profile of: Kind.contactPage
reuses property value: PropertyValueReuse
  reused property: scopeNote
  reused as property: scopeNote
  reused from resource: Kind.contactPage
cardinality: https://w3id.org/dsv/cardinality#01
domain: KontaktníBod
requirement level: optional
type: ObjectPropertyProfile
object property range: Dokument

has exact match
is part of: dcat-ap-cz-hvd#
type: TermProfile
preferred label: přesně odpovídá @cs
definition: skos:exactMatch is disjoint with each of the properties skos:broadMatch and skos:relatedMatch.
definition: Evropská licence, jíž podmínky užití přesně odpovídají. @cs
cardinality: https://w3id.org/dsv/cardinality#01
property: exactMatch
domain: SpecifikacePodmínekUžití
requirement level: recommended
type: ObjectPropertyProfile
object property range: European licence

has narrower match
is part of: dcat-ap-cz-hvd#
type: TermProfile
preferred label: méně restriktivní licence @cs
definition: skos:narrowMatch is used to state a hierarchical mapping link between two conceptual resources in different concept schemes.
definition: Evropská licence, která je méně restriktivní, než podmínky užití. @cs
cardinality: https://w3id.org/dsv/cardinality#01
property: narrowMatch
domain: SpecifikacePodmínekUžití
requirement level: recommended
type: ObjectPropertyProfile
object property range: European licence