DatováSada.příslušnýPrávníPředpis
is part of: dcat-ap-cz-otevřená-data#
type: TermProfile
scope note: Pro označení otevřených dat je povinné uvést http://data.europa.eu/eli/dir/2019/1024/oj
profile of: DatováSada.příslušnýPrávníPředpis
reuses property value: PropertyValueReuse
  reused property: prefLabel
  reused as property: prefLabel
  reused from resource: DatováSada.příslušnýPrávníPředpis
reuses property value: PropertyValueReuse
  reused property: definition
  reused as property: definition
  reused from resource: DatováSada.příslušnýPrávníPředpis
cardinality: 1n
domain: DatováSada
type: ObjectPropertyProfile
object property range: PrávníPředpis

Distribuce.příslušnýPrávníPředpis
is part of: dcat-ap-cz-otevřená-data#
type: TermProfile
scope note: Pro označení otevřených dat je povinné uvést http://data.europa.eu/eli/dir/2019/1024/oj
profile of: Distribuce.příslušnýPrávníPředpis
reuses property value: PropertyValueReuse
  reused property: prefLabel
  reused as property: prefLabel
  reused from resource: Distribuce.příslušnýPrávníPředpis
reuses property value: PropertyValueReuse
  reused property: definition
  reused as property: definition
  reused from resource: Distribuce.příslušnýPrávníPředpis
cardinality: 1n
domain: Distribuce
type: ObjectPropertyProfile
object property range: PrávníPředpis

DatováSlužba.příslušnýPrávníPředpis
is part of: dcat-ap-cz-otevřená-data#
type: TermProfile
scope note: Pro označení otevřených dat je povinné uvést http://data.europa.eu/eli/dir/2019/1024/oj
profile of: DatováSlužba.příslušnýPrávníPředpis
reuses property value: PropertyValueReuse
  reused property: prefLabel
  reused as property: prefLabel
  reused from resource: DatováSlužba.příslušnýPrávníPředpis
reuses property value: PropertyValueReuse
  reused property: definition
  reused as property: definition
  reused from resource: DatováSlužba.příslušnýPrávníPředpis
cardinality: 1n
domain: DatováSlužba
type: ObjectPropertyProfile
object property range: PrávníPředpis

specifikace podmínek užití
is part of: dcat-ap-cz-otevřená-data#
type: TermProfile
preferred label: Terms of use specification @en
profile of: Distribuce.specifikacePodmínekUžití
reuses property value: PropertyValueReuse
  reused property: definition
  reused as property: definition
  reused from resource: Distribuce.specifikacePodmínekUžití
reuses property value: PropertyValueReuse
  reused property: scopeNote
  reused as property: scopeNote
  reused from resource: Distribuce.specifikacePodmínekUžití
cardinality: https://w3id.org/dsv/cardinality#11
domain: Distribuce
type: ObjectPropertyProfile
object property range: SpecifikacePodmínekUžití

DatováSada.vstupníStránka
is part of: dcat-ap-cz-otevřená-data#
type: TermProfile
scope note: It is intended to point to a landing page at the original data provider, not to a page on a site of a third party, such as an aggregator. @en
scope note: Lze použít pro indikaci stránky datové sady v lokálním katalogu dat.
profile of: DatováSada.vstupníStránka
reuses property value: PropertyValueReuse
  reused property: prefLabel
  reused as property: prefLabel
  reused from resource: DatováSada.vstupníStránka
reuses property value: PropertyValueReuse
  reused property: definition
  reused as property: definition
  reused from resource: DatováSada.vstupníStránka
cardinality: https://w3id.org/dsv/cardinality#01
domain: DatováSada
requirement level: optional
type: ObjectPropertyProfile
object property range: Dokument

SérieDatovýchSad.vstupníStránka
is part of: dcat-ap-cz-otevřená-data#
type: TermProfile
scope note: Lze použít pro indikaci stránky série datových sad v lokálním katalogu dat.
profile of: SérieDatovýchSad.vstupníStránka
reuses property value: PropertyValueReuse
  reused property: prefLabel
  reused as property: prefLabel
  reused from resource: SérieDatovýchSad.vstupníStránka
reuses property value: PropertyValueReuse
  reused property: definition
  reused as property: definition
  reused from resource: SérieDatovýchSad.vstupníStránka
cardinality: https://w3id.org/dsv/cardinality#01
domain: SérieDatovýchSad
requirement level: optional
type: ObjectPropertyProfile
object property range: Dokument