Data Service
is part of: dcat-ap-cz#
type: TermProfile
preferred label: Servizio di dati @it
preferred label: Servicio de datos @es
preferred label: Datatjeneste @da
preferred label: Datová služba @cs
profile of: DataService
reuses property value: PropertyValueReuse
  reused property: definition
  reused from resource: DataService
reuses property value: PropertyValueReuse
  reused property: scopeNote
  reused from resource: DataService
type: ClassProfile
class role: main

Dataset Series
is part of: dcat-ap-cz#
type: TermProfile
preferred label: Serie de conjuntos de datos @es
preferred label: Serie di dataset @it
preferred label: Série datových sad @cs
definition: A collection of datasets that are published separately, but share some characteristics that group them.
definition: Una collezione di dataset che sono pubblicati separatamente, ma che condividono caratteristiche che li rendono parte di uno stesso gruppo. @it
definition: Una colección de conjuntos de datos publicados por separado, pero que comparten características que los agrupan. @es
definition: Série datových sad zastřešuje související datové sady a jiné série. Souvislost může být časová (rozpočet v letech), prostorová (seznamy ulic v obcích) či tématická (datové sady z jednoho systému). @cs
profile of: DatasetSeries
reuses property value: PropertyValueReuse
  reused property: scopeNote
  reused from resource: DatasetSeries
type: ClassProfile
class role: main

Kind
is part of: dcat-ap-cz#
type: TermProfile
preferred label: Kontaktní bod @cs
definition: A description following the vCard specification, e.g. to provide telephone number and e-mail address for a contact point.
definition: Obsahuje kontaktní informace, které mohou být využity pro zasílání připomínek. @cs
profile of: Kind
reuses property value: PropertyValueReuse
  reused property: scopeNote
  reused from resource: Kind
type: ClassProfile
class role: supportive

Period of Time
is part of: dcat-ap-cz#
type: TermProfile
preferred label: Časový interval @cs
definition: An interval of time that is named or defined by its start and end.
definition: Časový interval definovaný svým začátkem a koncem. @cs
profile of: PeriodOfTime
reuses property value: PropertyValueReuse
  reused property: scopeNote
  reused from resource: PeriodOfTime
type: ClassProfile
class role: supportive

Distribution
is part of: dcat-ap-cz#
type: TermProfile
preferred label: Distribuce - Datová služba @cs
preferred label: Distribución @es
preferred label: Distribuzione @it
preferred label: Διανομή @el
preferred label: التوزيع @ar
preferred label: 配信 @ja
definition: A specific representation of a dataset. A dataset might be available in multiple serializations that may differ in various ways, including natural language, media-type or format, schematic organization, temporal and spatial resolution, level of detail or profiles (which might specify any or all of the above).
definition: Konkrétní reprezentace datové sady datovou službou. @cs
definition: Rappresenta una forma disponibile e specifica del dataset. Ciascun dataset può essere disponibile in forme differenti, che possono rappresentare formati diversi o diversi punti di accesso per un dataset. Esempi di distribuzioni sono un file CSV scaricabile, una API o un RSS feed. @it
definition: Représente une forme spécifique d'un jeu de données. Caque jeu de données peut être disponible sous différentes formes, celles-ci pouvant représenter différents formats du jeu de données ou différents endpoint. Des exemples de distribution sont des fichirs CSV, des API ou des flux RSS. @fr
definition: Una representación específica de los datos. Cada conjunto de datos puede estar disponible en formas diferentes, las cuáles pueden variar en distintas formas, incluyendo el idioma, 'media-type' o formato, organización esquemática, resolución temporal y espacial, nivel de detalle o perfiles (que pueden especificar cualquiera o todas las diferencias anteriores). @es
definition: Αναπαριστά μία συγκεκριμένη διαθέσιμη μορφή ενός συνόλου δεδομένων. Κάθε σύνολο δεδομενων μπορεί να είναι διαθέσιμο σε διαφορετικές μορφές, οι μορφές αυτές μπορεί να αναπαριστούν διαφορετικές μορφές αρχείων ή διαφορετικά σημεία διάθεσης. Παραδείγματα διανομών συμπεριλαμβάνουν ένα μεταφορτώσιμο αρχείο μορφής CSV, ένα API ή ένα RSS feed. @el
definition: شكل محدد لقائمة البيانات يمكن الوصول إليه. قائمة بيانات ما يمكن أن تكون متاحه باشكال و أنواع متعددة. ملف يمكن تحميله أو واجهة برمجية يمكن من خلالها الوصول إلى البيانات هي أمثلة على ذلك. @ar
definition: データセットの特定の利用可能な形式を表わします。各データセットは、異なる形式で利用できることがあり、これらの形式は、データセットの異なる形式や、異なるエンドポイントを表わす可能性があります。配信の例には、ダウンロード可能なCSVファイル、API、RSSフィードが含まれます。 @ja
definition: En specifik repræsentation af et datasæt. Et datasæt kan være tilgængelig i mange serialiseringer der kan variere på forskellige vis, herunder sprog, medietype eller format, systemorganisering, tidslig- og geografisk opløsning, detaljeringsniveau eller profiler (der kan specificere en eller flere af ovenstående). @da
specializes: Distribuce
profile of: Distribution
type: ClassProfile
class role: main

Distribution
is part of: dcat-ap-cz#
type: TermProfile
preferred label: Distribuce - Soubor ke stažení @cs
preferred label: Distribución @es
preferred label: Distribuzione @it
preferred label: Διανομή @el
preferred label: التوزيع @ar
preferred label: 配信 @ja
definition: A specific representation of a dataset. A dataset might be available in multiple serializations that may differ in various ways, including natural language, media-type or format, schematic organization, temporal and spatial resolution, level of detail or profiles (which might specify any or all of the above).
definition: Konkrétní reprezentace datové sady jako souboru ke stažení. @cs
definition: Rappresenta una forma disponibile e specifica del dataset. Ciascun dataset può essere disponibile in forme differenti, che possono rappresentare formati diversi o diversi punti di accesso per un dataset. Esempi di distribuzioni sono un file CSV scaricabile, una API o un RSS feed. @it
definition: Représente une forme spécifique d'un jeu de données. Caque jeu de données peut être disponible sous différentes formes, celles-ci pouvant représenter différents formats du jeu de données ou différents endpoint. Des exemples de distribution sont des fichirs CSV, des API ou des flux RSS. @fr
definition: Una representación específica de los datos. Cada conjunto de datos puede estar disponible en formas diferentes, las cuáles pueden variar en distintas formas, incluyendo el idioma, 'media-type' o formato, organización esquemática, resolución temporal y espacial, nivel de detalle o perfiles (que pueden especificar cualquiera o todas las diferencias anteriores). @es
definition: Αναπαριστά μία συγκεκριμένη διαθέσιμη μορφή ενός συνόλου δεδομένων. Κάθε σύνολο δεδομενων μπορεί να είναι διαθέσιμο σε διαφορετικές μορφές, οι μορφές αυτές μπορεί να αναπαριστούν διαφορετικές μορφές αρχείων ή διαφορετικά σημεία διάθεσης. Παραδείγματα διανομών συμπεριλαμβάνουν ένα μεταφορτώσιμο αρχείο μορφής CSV, ένα API ή ένα RSS feed. @el
definition: شكل محدد لقائمة البيانات يمكن الوصول إليه. قائمة بيانات ما يمكن أن تكون متاحه باشكال و أنواع متعددة. ملف يمكن تحميله أو واجهة برمجية يمكن من خلالها الوصول إلى البيانات هي أمثلة على ذلك. @ar
definition: データセットの特定の利用可能な形式を表わします。各データセットは、異なる形式で利用できることがあり、これらの形式は、データセットの異なる形式や、異なるエンドポイントを表わす可能性があります。配信の例には、ダウンロード可能なCSVファイル、API、RSSフィードが含まれます。 @ja
definition: En specifik repræsentation af et datasæt. Et datasæt kan være tilgængelig i mange serialiseringer der kan variere på forskellige vis, herunder sprog, medietype eller format, systemorganisering, tidslig- og geografisk opløsning, detaljeringsniveau eller profiler (der kan specificere en eller flere af ovenstående). @da
specializes: Distribuce
profile of: Distribution
type: ClassProfile
class role: main

Media Type or Extent
is part of: dcat-ap-cz#
type: TermProfile
preferred label: Formát souboru @cs
definition: A media type or extent.
definition: Datový formát souboru. @cs
scope note: Formát souboru z evropského číselníku typů souborů EUV-FT. @cs
profile of: MediaTypeOrExtent
type: ClassProfile
class role: supportive

Media Type
is part of: dcat-ap-cz#
type: TermProfile
preferred label: Typ média @cs
definition: A file format or physical medium.
definition: Datový formát souboru. @cs
scope note: Typ média z číselníku IANA IANA-MEDIA-TYPES. @cs
profile of: MediaType
type: ClassProfile
class role: supportive

Location
is part of: dcat-ap-cz#
type: TermProfile
preferred label: Geografické území @cs
definition: A spatial region or named place.
definition: Území nebo pojmenované místo. @cs
scope note: It can be represented using a controlled vocabulary or with geographic coordinates. In the latter case, the use of the Core Location Vocabulary is recommended, following the approach described in the GeoDCAT-AP specification.
scope note: Hodnoty musí být z evropských číselníků kontinentů EUV-CONT, zemí EUV-COUNTRIES a míst EUV-PLACES, pokud tam jsou. Pokud ne, musí se jednat o URI z Geonames GEONAMES. @cs
profile of: Location
type: ClassProfile
class role: supportive

Frequency
is part of: dcat-ap-cz#
type: TermProfile
preferred label: Frekvence @cs
definition: A rate at which something recurs, e.g. the publication of a Dataset.
definition: Frekvence nějakého jevu, například aktualizace datové sady. @cs
scope note: Hodnoty jsou z evropského číselníku frekvencí EUV-FREQ. @cs
profile of: Frequency
type: ClassProfile
class role: supportive

Concept
is part of: dcat-ap-cz#
type: TermProfile
preferred label: Koncept @cs
definition: An idea or notion; a unit of thought.
definition: Pojem; myšlenková jednotka @cs
profile of: Concept
reuses property value: PropertyValueReuse
  reused property: scopeNote
  reused from resource: Concept
type: ClassProfile
class role: supportive

Concept
is part of: dcat-ap-cz#
type: TermProfile
preferred label: Datové téma @cs
definition: An idea or notion; a unit of thought.
definition: Datové téma. @cs
scope note: In DCAT-AP, a Concept is used to denote codes within a codelist. In section 10. Controlled Vocabularies the expectations are elaborated in more detail.
scope note: Datové téma z evropského číselníku datových témat EUV-THEMES. @cs
profile of: Concept
type: ClassProfile
class role: supportive

Concept
is part of: dcat-ap-cz#
type: TermProfile
preferred label: Téma EuroVoc @cs
definition: An idea or notion; a unit of thought.
definition: Datové téma z evropského tezauru EuroVoc. @cs
scope note: In DCAT-AP, a Concept is used to denote codes within a codelist. In section 10. Controlled Vocabularies the expectations are elaborated in more detail.
scope note: Téma z evropského tezauru EuroVoc EUV-EUROVOC. @cs
profile of: Concept
type: ClassProfile
class role: supportive

Legal Resource
is part of: dcat-ap-cz#
type: TermProfile
preferred label: Právní předpis @cs
definition: This class represents the legislation,policy or policies that lie behind the Rules that govern the service.
definition: Tato třída představuje legislativu nebo politiku, které stojí za pravidly upravujícími službu. @cs
profile of: LegalResource
reuses property value: PropertyValueReuse
  reused property: scopeNote
  reused from resource: LegalResource
type: ClassProfile
class role: supportive

Agent
is part of: dcat-ap-cz#
type: TermProfile
preferred label: Poskytovatel @cs
definition: Any entity carrying out actions with respect to the entities Catalogue and the Catalogued Resources.
definition: Poskytovatel dat @cs
profile of: Agent
reuses property value: PropertyValueReuse
  reused property: scopeNote
  reused from resource: Agent
type: ClassProfile
class role: supportive

Resource
is part of: dcat-ap-cz#
type: TermProfile
preferred label: Zdroj @cs
definition: Anything described by RDF.
definition: Cokoliv, co má URL. @cs
profile of: rdfs-Resource
reuses property value: PropertyValueReuse
  reused property: scopeNote
  reused from resource: rdfs-Resource
type: ClassProfile
class role: supportive

Location
is part of: dcat-ap-cz#
type: TermProfile
preferred label: Prvek z RÚIAN @cs
definition: A spatial region or named place.
definition: Územní prvek z RÚIAN. @cs
scope note: It can be represented using a controlled vocabulary or with geographic coordinates. In the latter case, the use of the Core Location Vocabulary is recommended, following the approach described in the GeoDCAT-AP specification.
scope note: Hodnota musí být IRI prvku z RÚIAN RUIAN. @cs
profile of: Location
type: ClassProfile
class role: supportive

Standard
is part of: dcat-ap-cz#
type: TermProfile
definition: A standard or other specification to which a resource conforms.
definition: Standard, specifikace. @cs
profile of: Standard
reuses property value: PropertyValueReuse
  reused property: scopeNote
  reused from resource: Standard
type: ClassProfile
class role: supportive

License Document
is part of: dcat-ap-cz#
type: TermProfile
preferred label: Licence @cs
definition: A legal document giving official permission to do something with a resource.
definition: Právní dokument oficiálně dovolující pracovat se zdrojem. @cs
type: ClassProfile
class: LicenseDocument
class role: supportive

Document
is part of: dcat-ap-cz#
type: TermProfile
preferred label: Dokument @cs
definition: A textual resource intended for human consumption that contains information, e.g. a web page about a Dataset.
definition: Textový dokument určený pro čtení lidmi. Například webová stránka. @cs
profile of: Document
reuses property value: PropertyValueReuse
  reused property: scopeNote
  reused from resource: Document
type: ClassProfile
class role: supportive

Individual
is part of: dcat-ap-cz#
type: TermProfile
preferred label: Jednotlivec @cs
definition: An object representing a single person or entity
definition: Jednotlivá fyzická osoba. @cs
specializes: Kind
type: ClassProfile
class: Individual
class role: supportive

Organization
is part of: dcat-ap-cz#
type: TermProfile
preferred label: Organizace @cs
definition: An object representing an organization. An organization is a single entity, and might represent a business or government, a department or division within a business or government, a club, an association, or the like.
definition: Organizace, právnická osoba nebo její část. @cs
specializes: Kind
type: ClassProfile
class: Organization
class role: supportive

HVD Category
is part of: dcat-ap-cz#
type: TermProfile
preferred label: Kategorie HVD @cs
definition: HVD Category from the High-value dataset categories EU Vocabulary
definition: Kategorie HVD z EU číselníku High-value dataset categories @cs
scope note: See https://op.europa.eu/en/web/eu-vocabularies/dataset/-/resource?uri=http://publications.europa.eu/resource/dataset/high-value-dataset-category
scope note: Téma z evropského číselníku kategorií HVD EUV-HVD. @cs
profile of: Concept
type: ClassProfile
class role: supportive

E-mail address
is part of: dcat-ap-cz#
type: TermProfile
preferred label: E-mailová adresa @cs
definition: E-mail address identified using mailto: IRI.
definition: E-mailová adresa identifikovaná pomocí mailto: IRI. @cs
profile of: Resource
reuses property value: PropertyValueReuse
  reused property: scopeNote
  reused from resource: Resource
type: ClassProfile
class role: supportive

in series
is part of: dcat-ap-cz#
type: TermProfile
preferred label: en serie @es
preferred label: in serie @it
preferred label: je součástí @cs
definition: A dataset series of which the dataset is part.
definition: Una serie de conjuntos de datos del cuál un conjunto de datos es parte. @es
definition: Una serie di dataset di cui questo dataset fa parte. @it
definition: Série datových sad, jíž je datová sada součástí. @cs
profile of: Dataset.inSeries
reuses property value: PropertyValueReuse
  reused property: scopeNote
  reused from resource: Dataset.inSeries
cardinality: https://w3id.org/dsv/cardinality#01
domain: DatováSada
type: ObjectPropertyProfile
object property range: Dataset Series

publisher
is part of: dcat-ap-cz#
type: TermProfile
preferred label: poskytovatel @cs
definition: An entity (organisation) responsible for making the Catalogue available.
definition: Poskytovatel datového katalogu. @cs
profile of: Catalogue.publisher
reuses property value: PropertyValueReuse
  reused property: scopeNote
  reused from resource: Catalogue.publisher
cardinality: https://w3id.org/dsv/cardinality#11
domain: Katalog
type: ObjectPropertyProfile
object property range: Agent

Katalog.kontaktníBod
is part of: dcat-ap-cz#
type: TermProfile
definition: Información relevante de contacto para el recurso catalogado. Se recomienda el uso de vCard. @es
definition: Informazioni di contatto rilevanti per la risorsa catalogata. Si raccomanda l'uso di vCard. @it
definition: Relevant contact information for the catalogued resource. Use of vCard is recommended.
definition: Tato vlastnost obsahuje kontaktní informace, které mohou být využity pro zasílání připomínek ke katalogu. @cs
definition: Relie un jeu de données à une information de contact utile en utilisant VCard. @fr
definition: Συνδέει ένα σύνολο δεδομένων με ένα σχετικό σημείο επικοινωνίας, μέσω VCard. @el
definition: تربط قائمة البيانات بعنوان اتصال موصف باستخدام VCard @ar
definition: データセットを、VCardを用いて提供されている適切な連絡先情報にリンクします。 @ja
definition: Relevante kontaktoplysninger for den katalogiserede ressource. Anvendelse af vCard anbefales. @da
reuses property value: PropertyValueReuse
  reused property: prefLabel
  reused from resource: contactPoint
cardinality: https://w3id.org/dsv/cardinality#01
property: contactPoint
domain: Katalog
type: ObjectPropertyProfile
object property range: Kind

homepage
is part of: dcat-ap-cz#
type: TermProfile
preferred label: domovská stránka @cs
definition: A web page that acts as the main page for the Catalogue.
definition: Tato vlastnost odkazuje na domovskou stránku lokálního katalogu, kam mohou chodit uživatelé. @cs
profile of: Catalogue.homepage
reuses property value: PropertyValueReuse
  reused property: scopeNote
  reused from resource: Catalogue.homepage
domain: Katalog
type: ObjectPropertyProfile
object property range: Document

publisher
is part of: dcat-ap-cz#
type: TermProfile
preferred label: poskytovatel @cs
definition: An entity (organisation) responsible for making the Dataset available.
definition: Poskytovatel datové sady @cs
profile of: Dataset.publisher
reuses property value: PropertyValueReuse
  reused property: scopeNote
  reused from resource: Dataset.publisher
cardinality: https://w3id.org/dsv/cardinality#01
domain: DatováSada
type: ObjectPropertyProfile
object property range: Agent

DatováSada.téma
is part of: dcat-ap-cz#
type: TermProfile
definition: A category of the Dataset.
definition: Téma datové sady. Datová sada může být popsána více tématy. @cs
definition: La categoria principale della risorsa. Una risorsa può avere più temi. @it
definition: La categoría principal del recurso. Un recurso puede tener varios temas. @es
definition: La catégorie principale de la ressource. Une ressource peut avoir plusieurs thèmes. @fr
definition: Η κύρια κατηγορία του συνόλου δεδομένων. Ένα σύνολο δεδομένων δύναται να έχει πολλαπλά θέματα. @el
definition: التصنيف الرئيسي لقائمة البيانات. قائمة البيانات يمكن أن تملك أكثر من تصنيف رئيسي واحد. @ar
definition: データセットの主要カテゴリー。データセットは複数のテーマを持つことができます。 @ja
definition: Et centralt emne for ressourcen. En ressource kan have flere centrale emner. @da
profile of: Dataset.theme
reuses property value: PropertyValueReuse
  reused property: prefLabel
  reused from resource: Dataset.theme
reuses property value: PropertyValueReuse
  reused property: scopeNote
  reused from resource: Dataset.theme
cardinality: 0n
domain: DatováSada
type: ObjectPropertyProfile
object property range: Concept

frequency
is part of: dcat-ap-cz#
type: TermProfile
preferred label: periodicita aktualizace @cs
definition: The frequency at which the Dataset is updated.
definition: Frekvence, se kterou je datová sada aktualizována. @cs
profile of: Dataset.frequency
reuses property value: PropertyValueReuse
  reused property: scopeNote
  reused from resource: Dataset.frequency
cardinality: https://w3id.org/dsv/cardinality#01
domain: DatováSada
type: ObjectPropertyProfile
object property range: Frequency

geographical coverage
is part of: dcat-ap-cz#
type: TermProfile
preferred label: související geografické území - prvek z RÚIAN @cs
definition: The geographical area covered by the dataset.
definition: Území pokryté datovou sadou, vyjádřené pomocí prvku RÚIAN @cs
profile of: Dataset.geographicalCoverage
reuses property value: PropertyValueReuse
  reused property: scopeNote
  reused from resource: Dataset.geographicalCoverage
cardinality: 0n
domain: DatováSada
type: ObjectPropertyProfile
object property range: Location

geographical coverage
is part of: dcat-ap-cz#
type: TermProfile
preferred label: související geografické území @cs
definition: The geographical area covered by the dataset.
definition: Území pokryté datovou sadou. @cs
profile of: Dataset.geographicalCoverage
reuses property value: PropertyValueReuse
  reused property: scopeNote
  reused from resource: Dataset.geographicalCoverage
cardinality: 0n
domain: DatováSada
type: ObjectPropertyProfile
object property range: Location

temporal coverage
is part of: dcat-ap-cz#
type: TermProfile
preferred label: časové pokrytí @cs
definition: The temporal period that the dataset covers.
definition: Časový úsek pokrytý datovou sadou @cs
profile of: Dataset.temporalCoverage
reuses property value: PropertyValueReuse
  reused property: scopeNote
  reused from resource: Dataset.temporalCoverage
cardinality: 0n
domain: DatováSada
type: ObjectPropertyProfile
object property range: Period of Time

DatováSada.kontaktníBod
is part of: dcat-ap-cz#
type: TermProfile
definition: Información relevante de contacto para el recurso catalogado. Se recomienda el uso de vCard. @es
definition: Informazioni di contatto rilevanti per la risorsa catalogata. Si raccomanda l'uso di vCard. @it
definition: Contact information that can be used for sending comments about the Dataset.
definition: Kontaktní informace, které mohou být využity pro zasílání připomínek k datové sadě. @cs
definition: Relie un jeu de données à une information de contact utile en utilisant VCard. @fr
definition: Συνδέει ένα σύνολο δεδομένων με ένα σχετικό σημείο επικοινωνίας, μέσω VCard. @el
definition: تربط قائمة البيانات بعنوان اتصال موصف باستخدام VCard @ar
definition: データセットを、VCardを用いて提供されている適切な連絡先情報にリンクします。 @ja
definition: Relevante kontaktoplysninger for den katalogiserede ressource. Anvendelse af vCard anbefales. @da
profile of: Dataset.contactPoint
reuses property value: PropertyValueReuse
  reused property: prefLabel
  reused from resource: Dataset.contactPoint
reuses property value: PropertyValueReuse
  reused property: scopeNote
  reused from resource: Dataset.contactPoint
cardinality: 0n
domain: DatováSada
type: ObjectPropertyProfile
object property range: Kind

documentation
is part of: dcat-ap-cz#
type: TermProfile
preferred label: dokumentace @cs
definition: A page or document about this Dataset.
definition: Stránka či dokument o datové sadě @cs
profile of: Dataset.documentation
reuses property value: PropertyValueReuse
  reused property: scopeNote
  reused from resource: Dataset.documentation
domain: DatováSada
type: ObjectPropertyProfile
object property range: Document

conforms to
is part of: dcat-ap-cz#
type: TermProfile
preferred label: specifikace @cs
definition: An implementing rule or other specification.
definition: Specifikace, jíž se datová sada řídí. @cs
profile of: Dataset.conformsTo
reuses property value: PropertyValueReuse
  reused property: scopeNote
  reused from resource: Dataset.conformsTo
cardinality: 0n
domain: DatováSada
type: ObjectPropertyProfile
object property range: Standard

theme
is part of: dcat-ap-cz#
type: TermProfile
preferred label: tema @es
preferred label: thème @fr
preferred label: klasifikace dle EuroVoc @cs
preferred label: Θέμα @el
preferred label: التصنيف @ar
preferred label: テーマ/カテゴリー @ja
preferred label: emne @da
definition: A category of the Dataset.
definition: Kategorie či téma datové sady dle EuroVoc. @cs
definition: La categoria principale della risorsa. Una risorsa può avere più temi. @it
definition: La categoría principal del recurso. Un recurso puede tener varios temas. @es
definition: La catégorie principale de la ressource. Une ressource peut avoir plusieurs thèmes. @fr
definition: Η κύρια κατηγορία του συνόλου δεδομένων. Ένα σύνολο δεδομένων δύναται να έχει πολλαπλά θέματα. @el
definition: التصنيف الرئيسي لقائمة البيانات. قائمة البيانات يمكن أن تملك أكثر من تصنيف رئيسي واحد. @ar
definition: データセットの主要カテゴリー。データセットは複数のテーマを持つことができます。 @ja
definition: Et centralt emne for ressourcen. En ressource kan have flere centrale emner. @da
profile of: Dataset.theme
reuses property value: PropertyValueReuse
  reused property: scopeNote
  reused from resource: Dataset.theme
cardinality: 0n
domain: DatováSada
type: ObjectPropertyProfile
object property range: Concept

applicable legislation
is part of: dcat-ap-cz#
type: TermProfile
preferred label: příslušný právní předpis @cs
definition: The legislation that mandates the creation or management of the Dataset.
definition: Indikace příslušného právního předpisu předepisujícího vznik datové sady. @cs
profile of: Dataset.applicableLegislation
reuses property value: PropertyValueReuse
  reused property: scopeNote
  reused from resource: Dataset.applicableLegislation
cardinality: 0n
domain: DatováSada
type: ObjectPropertyProfile
object property range: Legal Resource

access URL
is part of: dcat-ap-cz#
type: TermProfile
preferred label: URL d'accès @fr
preferred label: URL de acceso @es
preferred label: URL πρόσβασης @el
preferred label: indirizzo di accesso @it
preferred label: přístupové URL @cs
preferred label: رابط وصول @ar
preferred label: アクセスURL @ja
preferred label: adgangsadresse @da
profile of: Distribution.accessUrl
reuses property value: PropertyValueReuse
  reused property: definition
  reused from resource: Distribution.accessUrl
reuses property value: PropertyValueReuse
  reused property: scopeNote
  reused from resource: Distribution.accessUrl
cardinality: 0n
domain: Distribuce
type: ObjectPropertyProfile
object property range: Resource

applicable legislation
is part of: dcat-ap-cz#
type: TermProfile
preferred label: příslušný právní předpis @cs
definition: The legislation that mandates the creation or management of the Distribution.
definition: Indikace příslušného právního předpisu předepisujícího vznik distribuce. @cs
profile of: Distribution.applicableLegislation
reuses property value: PropertyValueReuse
  reused property: scopeNote
  reused from resource: Distribution.applicableLegislation
cardinality: 0n
domain: Distribuce
type: ObjectPropertyProfile
object property range: Legal Resource

applicable legislation
is part of: dcat-ap-cz#
type: TermProfile
preferred label: příslušný právní předpis @cs
definition: The legislation that mandates the creation or management of the Data Service.
definition: Indikace příslušného právního předpisu předepisujícího vznik datové služby. @cs
profile of: DataService.applicableLegislation
reuses property value: PropertyValueReuse
  reused property: scopeNote
  reused from resource: DataService.applicableLegislation
cardinality: 0n
domain: Data Service
type: ObjectPropertyProfile
object property range: Legal Resource

download URL
is part of: dcat-ap-cz#
type: TermProfile
preferred label: URL de descarga @es
preferred label: URL de téléchargement @fr
preferred label: URL di scarico @it
preferred label: odkaz na stažení souboru @cs
preferred label: URL μεταφόρτωσης @el
preferred label: رابط تحميل @ar
preferred label: ダウンロードURL @ja
preferred label: downloadURL @da
definition: Ceci est un lien direct à un fichier téléchargeable en un format donnée. Exple fichier CSV ou RDF. Le format est décrit par les propriétés de distribution dcterms:format et/ou dcat:mediaType. @fr
definition: La URL de un archivo descargable en el formato dato. Por ejemplo, archivo CSV o archivo RDF. El formato se describe con las propiedades de la distribución dcterms:format y/o dcat:mediaType. @es
definition: Questo è un link diretto al file scaricabile in un dato formato. E.g. un file CSV o un file RDF. Il formato è descritto dal dcterms:format e/o dal dcat:mediaType della distribuzione. @it
definition: A URL that is a direct link to a downloadable file in a given format.
definition: URL, které je přímým odkazem na stažitelný soubor v daném formátu. @cs
definition: dcat:downloadURLはdcat:accessURLの特定の形式です。しかし、DCATプロファイルが非ダウンロード・ロケーションに対してのみaccessURLを用いる場合には、より強い分離を課すことを望む可能性があるため、この含意を強化しないように、DCATは、dcat:downloadURLをdcat:accessURLのサブプロパティーであると定義しません。 @ja
definition: Είναι ένας σύνδεσμος άμεσης μεταφόρτωσης ενός αρχείου σε μια δεδομένη μορφή. Π.χ. ένα αρχείο CSV ή RDF. Η μορφη αρχείου περιγράφεται από τις ιδιότητες dcterms:format ή/και dcat:mediaType της διανομής. @el
definition: رابط مباشر لملف يمكن تحميله. نوع الملف يتم توصيفه باستخدام الخاصية dcterms:format dcat:mediaType @ar
definition: URL til fil der kan downloades i et bestemt format. Fx en CSV-fil eller en RDF-fil. Formatet for distributionen angives ved hjælp af egenskaberne dcterms:format og/eller dcat:mediaType. @da
profile of: Distribution.downloadUrl
reuses property value: PropertyValueReuse
  reused property: scopeNote
  reused from resource: Distribution.downloadUrl
cardinality: 0n
domain: Distribution
type: ObjectPropertyProfile
object property range: Resource

format
is part of: dcat-ap-cz#
type: TermProfile
preferred label: formát souboru ke stažení @cs
definition: The file format of the distribution.
definition: Tato vlastnost odkazuje na typ souboru s distribucí. @cs
profile of: Distribution.format
reuses property value: PropertyValueReuse
  reused property: scopeNote
  reused from resource: Distribution.format
cardinality: https://w3id.org/dsv/cardinality#01
domain: Distribution
type: ObjectPropertyProfile
object property range: Media Type or Extent

linked schemas
is part of: dcat-ap-cz#
type: TermProfile
preferred label: strojově čitelné schéma souboru ke stažení @cs
definition: An established standard to which the distribution conforms.
definition: Ustanovené schéma, jímž se popisovaná distribuce řídí. @cs
profile of: Distribution.linkedSchemas
reuses property value: PropertyValueReuse
  reused property: scopeNote
  reused from resource: Distribution.linkedSchemas
cardinality: 0n
domain: Distribution
type: ObjectPropertyProfile
object property range: Resource

access service
is part of: dcat-ap-cz#
type: TermProfile
preferred label: servicio de acceso de datos @es
preferred label: servizio di accesso ai dati @it
preferred label: přístupová služba @cs
preferred label: dataadgangstjeneste @da
profile of: Distribution.accessService
reuses property value: PropertyValueReuse
  reused property: definition
  reused from resource: Distribution.accessService
reuses property value: PropertyValueReuse
  reused property: scopeNote
  reused from resource: Distribution.accessService
cardinality: 0n
domain: Distribution
type: ObjectPropertyProfile
object property range: Data Service

conforms to
is part of: dcat-ap-cz#
type: TermProfile
preferred label: specifikace @cs
definition: An established (technical) standard to which the Data Service conforms.
definition: Specifikaci, jíž se datová služba řídí. @cs
scope note: Takovou specifikací je například SPARQL. Seznam možných hodnot lze nalézt například v seznamu udržovaném Open Source Geospatial Foundation. @cs
profile of: DataService.conformsTo
cardinality: 0n
domain: Data Service
type: ObjectPropertyProfile
object property range: Standard

documentation
is part of: dcat-ap-cz#
type: TermProfile
preferred label: dokumentace @cs
definition: A page or document about this Data Service
definition: Dokumentace dále popisující datovou službu. @cs
profile of: DataService.documentation
reuses property value: PropertyValueReuse
  reused property: scopeNote
  reused from resource: DataService.documentation
domain: Data Service
type: ObjectPropertyProfile
object property range: Document

Copyrighted database
is part of: dcat-ap-cz#
type: TermProfile
preferred label: originální databáze @cs
reuses property value: PropertyValueReuse
  reused property: definition
  reused from resource: databáze-jako-autorské-dílo
cardinality: https://w3id.org/dsv/cardinality#01
property: databáze-jako-autorské-dílo
domain: SpecifikacePodmínekUžití
type: ObjectPropertyProfile
object property range: License Document

Copyrighted work
is part of: dcat-ap-cz#
type: TermProfile
preferred label: autorské dílo @cs
reuses property value: PropertyValueReuse
  reused property: definition
  reused from resource: autorské-dílo
cardinality: https://w3id.org/dsv/cardinality#01
property: autorské-dílo
domain: SpecifikacePodmínekUžití
type: ObjectPropertyProfile
object property range: License Document

Sui generis database rights
is part of: dcat-ap-cz#
type: TermProfile
preferred label: zvláštní právo pořizovatele databáze @cs
reuses property value: PropertyValueReuse
  reused property: definition
  reused from resource: databáze-chráněná-zvláštními-právy
cardinality: https://w3id.org/dsv/cardinality#01
property: databáze-chráněná-zvláštními-právy
domain: SpecifikacePodmínekUžití
type: ObjectPropertyProfile
object property range: License Document

Personal data
is part of: dcat-ap-cz#
type: TermProfile
preferred label: osobní údaje @cs
reuses property value: PropertyValueReuse
  reused property: definition
  reused from resource: osobní-údaje
cardinality: https://w3id.org/dsv/cardinality#01
property: osobní-údaje
domain: SpecifikacePodmínekUžití
type: ObjectPropertyProfile
object property range: License Document

has email
is part of: dcat-ap-cz#
type: TermProfile
preferred label: email @cs
definition: To specify the electronic mail address for communication with the object
definition: E-mailová adresa pro komunikaci. @cs
cardinality: https://w3id.org/dsv/cardinality#01
property: hasEmail
domain: Kind
type: ObjectPropertyProfile
object property range: E-mail address

HVD category
is part of: dcat-ap-cz#
type: TermProfile
preferred label: kategorie HVD @cs
definition: A data category defined in the High Value Dataset Implementing Regulation.
definition: Kategorie datové sady s vysokou socio-ekonomickou hodnotou @cs
cardinality: 0n
property: hvdCategory
domain: DatováSada
type: ObjectPropertyProfile
object property range: HVD Category

HVD category
is part of: dcat-ap-cz#
type: TermProfile
preferred label: kategorie HVD @cs
definition: A data category defined in the High Value Dataset Implementing Regulation.
definition: Kategorie datové služby s vysokou socio-ekonomickou hodnotou. @cs
cardinality: 0n
property: hvdCategory
domain: Data Service
type: ObjectPropertyProfile
object property range: HVD Category

applicable legislation
is part of: dcat-ap-cz#
type: TermProfile
preferred label: příslušný právní předpis @cs
definition: The legislation that mandates the creation or management of the Dataset Series.
definition: Indikace příslušného právního předpisu předepisujícího vznik série datových sad. @cs
profile of: DatasetSeries.applicableLegislation
reuses property value: PropertyValueReuse
  reused property: scopeNote
  reused from resource: DatasetSeries.applicableLegislation
cardinality: 0n
domain: Dataset Series
type: ObjectPropertyProfile
object property range: Legal Resource

frequency
is part of: dcat-ap-cz#
type: TermProfile
preferred label: periodicita aktualizace @cs
definition: The frequency at which the Dataset Series is updated.
definition: Frekvence, se kterou je série datových sad aktualizována. @cs
profile of: DatasetSeries.frequency
reuses property value: PropertyValueReuse
  reused property: scopeNote
  reused from resource: DatasetSeries.frequency
cardinality: https://w3id.org/dsv/cardinality#01
domain: Dataset Series
type: ObjectPropertyProfile
object property range: Frequency

geographical coverage
is part of: dcat-ap-cz#
type: TermProfile
preferred label: související geografické území @cs
definition: A geographic region that is covered by the Dataset Series.
definition: Geografické území pokryté sérií datových sad. @cs
profile of: DatasetSeries.geographicalCoverage
reuses property value: PropertyValueReuse
  reused property: scopeNote
  reused from resource: DatasetSeries.geographicalCoverage
cardinality: 0n
domain: Dataset Series
type: ObjectPropertyProfile
object property range: Location

SérieDatovýchSad.kontaktníBod
is part of: dcat-ap-cz#
type: TermProfile
definition: Información relevante de contacto para el recurso catalogado. Se recomienda el uso de vCard. @es
definition: Informazioni di contatto rilevanti per la risorsa catalogata. Si raccomanda l'uso di vCard. @it
definition: Contact information that can be used for sending comments about the Dataset Series.
definition: Kontaktní informace, které mohou být využity pro zasílání připomínek k sérii datových sad. @cs
definition: Relie un jeu de données à une information de contact utile en utilisant VCard. @fr
definition: Συνδέει ένα σύνολο δεδομένων με ένα σχετικό σημείο επικοινωνίας, μέσω VCard. @el
definition: تربط قائمة البيانات بعنوان اتصال موصف باستخدام VCard @ar
definition: データセットを、VCardを用いて提供されている適切な連絡先情報にリンクします。 @ja
definition: Relevante kontaktoplysninger for den katalogiserede ressource. Anvendelse af vCard anbefales. @da
profile of: DatasetSeries.contactPoint
reuses property value: PropertyValueReuse
  reused property: prefLabel
  reused from resource: DatasetSeries.contactPoint
reuses property value: PropertyValueReuse
  reused property: scopeNote
  reused from resource: DatasetSeries.contactPoint
cardinality: 0n
domain: Dataset Series
type: ObjectPropertyProfile
object property range: Kind

publisher
is part of: dcat-ap-cz#
type: TermProfile
preferred label: poskytovatel @cs
definition: An entity (organisation) responsible for ensuring the coherency of the Dataset Series.
definition: Poskytovatel série datových sad zajišťující její soudržnost. @cs
profile of: DatasetSeries.publisher
reuses property value: PropertyValueReuse
  reused property: scopeNote
  reused from resource: DatasetSeries.publisher
cardinality: https://w3id.org/dsv/cardinality#01
domain: Dataset Series
type: ObjectPropertyProfile
object property range: Agent

temporal coverage
is part of: dcat-ap-cz#
type: TermProfile
preferred label: časové pokrytí @cs
definition: A temporal period that the Dataset Series covers.
definition: Časový úsek pokrytý sérií datových sad @cs
profile of: DatasetSeries.temporalCoverage
reuses property value: PropertyValueReuse
  reused property: scopeNote
  reused from resource: DatasetSeries.temporalCoverage
cardinality: 0n
domain: Dataset Series
type: ObjectPropertyProfile
object property range: Period of Time

documentation
is part of: dcat-ap-cz#
type: TermProfile
preferred label: dokumentace @cs
definition: A page or document about this Dataset.
definition: Stránka či dokument o sérii datových sad @cs
profile of: Dataset.documentation
reuses property value: PropertyValueReuse
  reused property: scopeNote
  reused from resource: Dataset.documentation
cardinality: 0n
domain: Dataset Series
type: ObjectPropertyProfile
object property range: Document

in series
is part of: dcat-ap-cz#
type: TermProfile
preferred label: en serie @es
preferred label: in serie @it
preferred label: je součástí @cs
definition: A dataset series of which the dataset is part.
definition: Una serie de conjuntos de datos del cuál un conjunto de datos es parte. @es
definition: Una serie di dataset di cui questo dataset fa parte. @it
definition: Série datových sad, jíž je tato série datových sad součástí. @cs
profile of: Dataset.inSeries
reuses property value: PropertyValueReuse
  reused property: scopeNote
  reused from resource: Dataset.inSeries
cardinality: 0n
domain: Dataset Series
type: ObjectPropertyProfile
object property range: Dataset Series

theme
is part of: dcat-ap-cz#
type: TermProfile
preferred label: tema @es
preferred label: thème @fr
preferred label: klasifikace dle EuroVoc @cs
preferred label: Θέμα @el
preferred label: التصنيف @ar
preferred label: テーマ/カテゴリー @ja
preferred label: emne @da
definition: A category of the Dataset.
definition: Kategorie či téma série datových sad dle EuroVoc. @cs
definition: La categoria principale della risorsa. Una risorsa può avere più temi. @it
definition: La categoría principal del recurso. Un recurso puede tener varios temas. @es
definition: La catégorie principale de la ressource. Une ressource peut avoir plusieurs thèmes. @fr
definition: Η κύρια κατηγορία του συνόλου δεδομένων. Ένα σύνολο δεδομένων δύναται να έχει πολλαπλά θέματα. @el
definition: التصنيف الرئيسي لقائمة البيانات. قائمة البيانات يمكن أن تملك أكثر من تصنيف رئيسي واحد. @ar
definition: データセットの主要カテゴリー。データセットは複数のテーマを持つことができます。 @ja
definition: Et centralt emne for ressourcen. En ressource kan have flere centrale emner. @da
profile of: Dataset.theme
reuses property value: PropertyValueReuse
  reused property: scopeNote
  reused from resource: Dataset.theme
cardinality: 0n
domain: Dataset Series
type: ObjectPropertyProfile
object property range: Concept

geographical coverage
is part of: dcat-ap-cz#
type: TermProfile
preferred label: související geografické území - prvek z RÚIAN @cs
definition: The geographical area covered by the dataset.
definition: Území pokryté datovou sadou, vyjádřené pomocí prvku RÚIAN @cs
profile of: Dataset.geographicalCoverage
reuses property value: PropertyValueReuse
  reused property: scopeNote
  reused from resource: Dataset.geographicalCoverage
cardinality: 0n
domain: Dataset Series
type: ObjectPropertyProfile
object property range: Location

DatováSada.vstupníStránka
is part of: dcat-ap-cz#
type: TermProfile
definition: A web page that provides access to the Dataset, its Distributions and/or additional information.
definition: Una pagina web che può essere navigata per ottenere l'accesso al catalogo, ad un dataset, alle distribuzioni del dataset e/o ad informazioni addizionali. @it
definition: Una página web que puede ser visitada en un explorador Web para tener acceso el catálogo, un conjunto de datos, sus distribuciones y/o información adicional. @es
definition: Une page Web accessible par un navigateur Web donnant accès au catalogue, un jeu de données, ses distributions et/ou des informations additionnelles. @fr
definition: Webová stránka, na kterou lze pro získání přístupu k datové sadě, jejím distribucím a/nebo dalším informacím přistoupit webovým prohlížečem. @cs
definition: Μία ιστοσελίδα πλοηγίσιμη μέσω ενός φυλλομετρητή (Web browser) που δίνει πρόσβαση στο σύνολο δεδομένων, τις διανομές αυτού ή/και επιπρόσθετες πληροφορίες. @el
definition: صفحة وب يمكن من خلالها الوصول الى قائمة البيانات أو إلى معلومات إضافية متعلقة بها @ar
definition: データセット、その配信および（または）追加情報にアクセスするためにウエブ・ブラウザでナビゲートできるウェブページ。 @ja
definition: En webside som der kan navigeres til i en webbrowser for at få adgang til kataloget, et datasæt, dets distributioner og/eller yderligere information. @da
profile of: Dataset.landingPage
reuses property value: PropertyValueReuse
  reused property: prefLabel
  reused from resource: Dataset.landingPage
reuses property value: PropertyValueReuse
  reused property: scopeNote
  reused from resource: Dataset.landingPage
domain: DatováSada
type: ObjectPropertyProfile
object property range: Document

SérieDatovýchSad.vstupníStránka
is part of: dcat-ap-cz#
type: TermProfile
definition: A Web page that can be navigated to in a Web browser to gain access to the catalog, a dataset, its distributions and/or additional information.
definition: Una pagina web che può essere navigata per ottenere l'accesso al catalogo, ad un dataset, alle distribuzioni del dataset e/o ad informazioni addizionali. @it
definition: Una página web que puede ser visitada en un explorador Web para tener acceso el catálogo, un conjunto de datos, sus distribuciones y/o información adicional. @es
definition: Une page Web accessible par un navigateur Web donnant accès au catalogue, un jeu de données, ses distributions et/ou des informations additionnelles. @fr
definition: Webová stránka, na kterou lze pro získání přístupu ke sérii datových sad přistoupit webovým prohlížečem. @cs
definition: Μία ιστοσελίδα πλοηγίσιμη μέσω ενός φυλλομετρητή (Web browser) που δίνει πρόσβαση στο σύνολο δεδομένων, τις διανομές αυτού ή/και επιπρόσθετες πληροφορίες. @el
definition: صفحة وب يمكن من خلالها الوصول الى قائمة البيانات أو إلى معلومات إضافية متعلقة بها @ar
definition: データセット、その配信および（または）追加情報にアクセスするためにウエブ・ブラウザでナビゲートできるウェブページ。 @ja
definition: En webside som der kan navigeres til i en webbrowser for at få adgang til kataloget, et datasæt, dets distributioner og/eller yderligere information. @da
profile of: CatalogedResource.landingPage
reuses property value: PropertyValueReuse
  reused property: prefLabel
  reused from resource: CatalogedResource.landingPage
reuses property value: PropertyValueReuse
  reused property: scopeNote
  reused from resource: CatalogedResource.landingPage
domain: Dataset Series
type: ObjectPropertyProfile
object property range: Document

description
is part of: dcat-ap-cz#
type: TermProfile
preferred label: popis @cs
definition: A free-text account of the Catalogue.
definition: Tato vlastnost obsahuje volný text s popisem datového katalogu. @cs
profile of: Catalogue.description
reuses property value: PropertyValueReuse
  reused property: scopeNote
  reused from resource: Catalogue.description
cardinality: https://w3id.org/dsv/cardinality#11
domain: Katalog
type: DatatypePropertyProfile
datatype property range: text

title
is part of: dcat-ap-cz#
type: TermProfile
preferred label: název @cs
definition: A name given to the Catalogue.
definition: Tato vlastnost obsahuje název datového katalogu. @cs
profile of: Catalogue.title
reuses property value: PropertyValueReuse
  reused property: scopeNote
  reused from resource: Catalogue.title
cardinality: https://w3id.org/dsv/cardinality#11
domain: Katalog
type: DatatypePropertyProfile
datatype property range: text

title
is part of: dcat-ap-cz#
type: TermProfile
preferred label: název @cs
definition: Název datové sady
profile of: Dataset.title
reuses property value: PropertyValueReuse
  reused property: scopeNote
  reused from resource: Dataset.title
cardinality: https://w3id.org/dsv/cardinality#11
domain: DatováSada
type: DatatypePropertyProfile
datatype property range: text

description
is part of: dcat-ap-cz#
type: TermProfile
preferred label: popis @cs
definition: A free-text account of the Dataset.
definition: Volný text s popisem datové sady @cs
profile of: Dataset.description
reuses property value: PropertyValueReuse
  reused property: scopeNote
  reused from resource: Dataset.description
cardinality: https://w3id.org/dsv/cardinality#11
domain: DatováSada
type: DatatypePropertyProfile
datatype property range: text

spatial resolution (meters)
is part of: dcat-ap-cz#
type: TermProfile
preferred label: prostorové rozlišení v metrech @cs
preferred label: resolución espacial (metros) @es
preferred label: risoluzione spaziale (metri) @it
preferred label: spatial resolution (metres)
preferred label: geografisk opløsning (meter) @da
preferred label: spatial resolution
definition: minimum spatial separation resolvable in a dataset, measured in meters.
definition: minimum spatial separation resolvable in a dataset, measured in metres.
definition: Prostorové rozlišení dat v datové sadě v metrech. Jedná se o nejmenší prostorový rozdíl v datové sadě. @cs
definition: mínima separacíon espacial disponible en un conjunto de datos, medida en metros. @es
definition: separazione spaziale minima risolvibile in un set di dati, misurata in metri. @it
definition: mindste geografiske afstand som kan erkendes i et datasæt, målt i meter. @da
definition: Minimum spatial separation resolvable in a dataset, measured in meters.
profile of: Dataset.spatialResolution
reuses property value: PropertyValueReuse
  reused property: scopeNote
  reused from resource: Dataset.spatialResolution
cardinality: https://w3id.org/dsv/cardinality#01
domain: DatováSada
type: DatatypePropertyProfile
datatype property range: decimal

DatováSada.časovéRozlišení
is part of: dcat-ap-cz#
type: TermProfile
definition: Minimum time period resolvable in the dataset.
definition: Časové rozlišení dat v datové sadě. Jedná se o nejmenší časový rozdíl v datové sadě. @cs
definition: periodo di tempo minimo risolvibile in un set di dati. @it
definition: período de tiempo mínimo en el conjunto de datos. @es
definition: mindste tidsperiode der kan resolveres i datasættet. @da
profile of: Dataset.temporalResolution
reuses property value: PropertyValueReuse
  reused property: prefLabel
  reused from resource: Dataset.temporalResolution
reuses property value: PropertyValueReuse
  reused property: scopeNote
  reused from resource: Dataset.temporalResolution
cardinality: https://w3id.org/dsv/cardinality#01
domain: DatováSada
type: DatatypePropertyProfile
datatype property range: duration

title
is part of: dcat-ap-cz#
type: TermProfile
preferred label: název @cs
definition: A name given to the distribution.
definition: Název distribuce datové sady @cs
profile of: Distribution.title
reuses property value: PropertyValueReuse
  reused property: scopeNote
  reused from resource: Distribution.title
cardinality: https://w3id.org/dsv/cardinality#01
domain: Distribuce
type: DatatypePropertyProfile
datatype property range: text

title
is part of: dcat-ap-cz#
type: TermProfile
preferred label: název @cs
definition: A name given to the Data Service.
definition: Název datové služby. @cs
profile of: DataService.title
reuses property value: PropertyValueReuse
  reused property: scopeNote
  reused from resource: DataService.title
cardinality: https://w3id.org/dsv/cardinality#11
domain: Data Service
type: DatatypePropertyProfile
datatype property range: text

Names of authors of database
is part of: dcat-ap-cz#
type: TermProfile
preferred label: jména autorů originální databáze @cs
reuses property value: PropertyValueReuse
  reused property: definition
  reused from resource: autor-databáze
cardinality: https://w3id.org/dsv/cardinality#01
property: autor-databáze
domain: SpecifikacePodmínekUžití
type: DatatypePropertyProfile
datatype property range: langString

Names of authors
is part of: dcat-ap-cz#
type: TermProfile
preferred label: jména autorů díla @cs
reuses property value: PropertyValueReuse
  reused property: definition
  reused from resource: autor
cardinality: https://w3id.org/dsv/cardinality#01
property: autor
domain: SpecifikacePodmínekUžití
type: DatatypePropertyProfile
datatype property range: langString

ČasovýInterval.datumZačátku
is part of: dcat-ap-cz#
type: TermProfile
definition: The start of the period.
definition: Začátek doby trvání. @cs
profile of: PeriodOfTime.startDate
reuses property value: PropertyValueReuse
  reused property: prefLabel
  reused from resource: PeriodOfTime.startDate
reuses property value: PropertyValueReuse
  reused property: scopeNote
  reused from resource: PeriodOfTime.startDate
cardinality: https://w3id.org/dsv/cardinality#01
domain: Period of Time
type: DatatypePropertyProfile
datatype property range: date

formatted name
is part of: dcat-ap-cz#
type: TermProfile
preferred label: jméno @cs
definition: The formatted text corresponding to the name of the object
definition: Jméno objektu jako formátovaný text. @cs
cardinality: https://w3id.org/dsv/cardinality#01
property: fn
domain: Kind
type: DatatypePropertyProfile
datatype property range: text

title
is part of: dcat-ap-cz#
type: TermProfile
preferred label: název @cs
definition: A name given to the Dataset Series.
definition: Název série datových sad @cs
profile of: DatasetSeries.title
reuses property value: PropertyValueReuse
  reused property: scopeNote
  reused from resource: DatasetSeries.title
cardinality: https://w3id.org/dsv/cardinality#11
domain: Dataset Series
type: DatatypePropertyProfile
datatype property range: text

description
is part of: dcat-ap-cz#
type: TermProfile
preferred label: popis @cs
definition: A free-text account of the Dataset Series.
definition: Volný text s popisem série datových sad @cs
profile of: DatasetSeries.description
reuses property value: PropertyValueReuse
  reused property: scopeNote
  reused from resource: DatasetSeries.description
cardinality: https://w3id.org/dsv/cardinality#11
domain: Dataset Series
type: DatatypePropertyProfile
datatype property range: text